{"text_format":"1","workbook":"xlsx","n_sheets":5,"sheets":["Ventes","Localisations","Objectifs","Analyses","Tableau de Bord"],"not_rendered":{"charts":5,"images":2,"macros":1,"external_links":0,"defined_names":8,"comments":0,"pivot_tables":7},"unopened":[],"bounds":{"document_bytes":16777216,"sheet_cells":100000,"rows_first":2000,"rows_last":500,"rows_between":2000,"halvings":0,"cell_chars":16384,"cell_head_chars":4096},"cells_cut":0,"cells_raw":0,"read":"whole","date_system":"1900"}

{"sheet":"Ventes","index":0,"n_rows":832,"n_cols":10,"rows_kept":832,"cut":false,"hidden":false,"merged":[]}
[]
["DATES","CLIENTS","PRODUITS","PRIX UNITAIRE (FCFA)","QUANTITE","Prix d'achat","Pays","Région","mois","semaine"]
["2021-01-01","client33","Produit24",156.96,9,{"$f":"ventes[[#This Row],[PRIX UNITAIRE (FCFA)]]*ventes[[#This Row],[QUANTITE]]","v":1412.64},{"$f":"VLOOKUP(ventes[[#This Row],[CLIENTS]],localisations[],2,0)","v":"Philippines"},{"$f":"VLOOKUP(ventes[[#This Row],[CLIENTS]],localisations[],3,0)","v":"Asie"},{"$f":"TEXT(ventes[[#This Row],[DATES]],\"mmm\")","v":"janv"},{"$f":"WEEKNUM(ventes[[#This Row],[DATES]])","v":1}]
["2021-01-01","client29","Produit22",141.57,1,{"$f":"ventes[[#This Row],[PRIX UNITAIRE (FCFA)]]*ventes[[#This Row],[QUANTITE]]","v":141.57},{"$f":"VLOOKUP(ventes[[#This Row],[CLIENTS]],localisations[],2,0)","v":"Chili"},{"$f":"VLOOKUP(ventes[[#This Row],[CLIENTS]],localisations[],3,0)","v":"Amérique"},{"$f":"TEXT(ventes[[#This Row],[DATES]],\"mmm\")","v":"janv"},{"$f":"WEEKNUM(ventes[[#This Row],[DATES]])","v":1}]
["2021-01-02","client31","Produit38",79.92,15,{"$f":"ventes[[#This Row],[PRIX UNITAIRE (FCFA)]]*ventes[[#This Row],[QUANTITE]]","v":1198.8},{"$f":"VLOOKUP(ventes[[#This Row],[CLIENTS]],localisations[],2,0)","v":"Corée du Sud"},{"$f":"VLOOKUP(ventes[[#This Row],[CLIENTS]],localisations[],3,0)","v":"Asie"},{"$f":"TEXT(ventes[[#This Row],[DATES]],\"mmm\")","v":"janv"},{"$f":"WEEKNUM(ventes[[#This Row],[DATES]])","v":1}]
["2021-01-02","client03","Produit33",119.7,1,{"$f":"ventes[[#This Row],[PRIX UNITAIRE (FCFA)]]*ventes[[#This Row],[QUANTITE]]","v":119.7},{"$f":"VLOOKUP(ventes[[#This Row],[CLIENTS]],localisations[],2,0)","v":"Côte d'Ivoire"},{"$f":"VLOOKUP(ventes[[#This Row],[CLIENTS]],localisations[],3,0)","v":"Afrique"},{"$f":"TEXT(ventes[[#This Row],[DATES]],\"mmm\")","v":"janv"},{"$f":"WEEKNUM(ventes[[#This Row],[DATES]])","v":1}]
["2021-01-02","client05","Produit15",15.719999999999999,2,{"$f":"ventes[[#This Row],[PRIX UNITAIRE (FCFA)]]*ventes[[#This Row],[QUANTITE]]","v":31.439999999999998},{"$f":"VLOOKUP(ventes[[#This Row],[CLIENTS]],localisations[],2,0)","v":"Algérie"},{"$f":"VLOOKUP(ventes[[#This Row],[CLIENTS]],localisations[],3,0)","v":"Afrique"},{"$f":"TEXT(ventes[[#This Row],[DATES]],\"mmm\")","v":"janv"},{"$f":"WEEKNUM(ventes[[#This Row],[DATES]])","v":1}]
["2021-01-02","client35","Produit10",164.28,7,{"$f":"ventes[[#This Row],[PRIX UNITAIRE (FCFA)]]*ventes[[#This Row],[QUANTITE]]","v":1149.96},{"$f":"VLOOKUP(ventes[[#This Row],[CLIENTS]],localisations[],2,0)","v":"Malaisie"},{"$f":"VLOOKUP(ventes[[#This Row],[CLIENTS]],localisations[],3,0)","v":"Asie"},{"$f":"TEXT(ventes[[#This Row],[DATES]],\"mmm\")","v":"janv"},{"$f":"WEEKNUM(ventes[[#This Row],[DATES]])","v":1}]
["2021-01-02","client38","Produit13",122.08,6,{"$f":"ventes[[#This Row],[PRIX UNITAIRE (FCFA)]]*ventes[[#This Row],[QUANTITE]]","v":732.48},{"$f":"VLOOKUP(ventes[[#This Row],[CLIENTS]],localisations[],2,0)","v":"Pakistan"},{"$f":"VLOOKUP(ventes[[#This Row],[CLIENTS]],localisations[],3,0)","v":"Asie"},{"$f":"TEXT(ventes[[#This Row],[DATES]],\"mmm\")","v":"janv"},{"$f":"WEEKNUM(ventes[[#This Row],[DATES]])","v":1}]
["2021-01-02","client39","Produit15",15.719999999999999,25,{"$f":"ventes[[#This Row],[PRIX UNITAIRE (FCFA)]]*ventes[[#This Row],[QUANTITE]]","v":393},{"$f":"VLOOKUP(ventes[[#This Row],[CLIENTS]],localisations[],2,0)","v":"Pakistan"},{"$f":"VLOOKUP(ventes[[#This Row],[CLIENTS]],localisations[],3,0)","v":"Asie"},{"$f":"TEXT(ventes[[#This Row],[DATES]],\"mmm\")","v":"janv"},{"$f":"WEEKNUM(ventes[[#This Row],[DATES]])","v":1}]
["2021-01-03","client34","Produit14",146.72,21,{"$f":"ventes[[#This Row],[PRIX UNITAIRE (FCFA)]]*ventes[[#This Row],[QUANTITE]]","v":3081.12},{"$f":"VLOOKUP(ventes[[#This Row],[CLIENTS]],localisations[],2,0)","v":"Japon"},{"$f":"VLOOKUP(ventes[[#This Row],[CLIENTS]],localisations[],3,0)","v":"Asie"},{"$f":"TEXT(ventes[[#This Row],[DATES]],\"mmm\")","v":"janv"},{"$f":"WEEKNUM(ventes[[#This Row],[DATES]])","v":2}]
["2021-01-03","client18","Produit43",83.08,9,{"$f":"ventes[[#This Row],[PRIX UNITAIRE (FCFA)]]*ventes[[#This Row],[QUANTITE]]","v":747.72},{"$f":"VLOOKUP(ventes[[#This Row],[CLIENTS]],localisations[],2,0)","v":"Belgique"},{"$f":"VLOOKUP(ventes[[#This Row],[CLIENTS]],localisations[],3,0)","v":"Europe"},{"$f":"TEXT(ventes[[#This Row],[DATES]],\"mmm\")","v":"janv"},{"$f":"WEEKNUM(ventes[[#This Row],[DATES]])","v":2}]
["2021-01-03","client20","Produit38",79.92,31,{"$f":"ventes[[#This Row],[PRIX UNITAIRE (FCFA)]]*ventes[[#This Row],[QUANTITE]]","v":2477.52},{"$f":"VLOOKUP(ventes[[#This Row],[CLIENTS]],localisations[],2,0)","v":"France"},{"$f":"VLOOKUP(ventes[[#This Row],[CLIENTS]],localisations[],3,0)","v":"Europe"},{"$f":"TEXT(ventes[[#This Row],[DATES]],\"mmm\")","v":"janv"},{"$f":"WEEKNUM(ventes[[#This Row],[DATES]])","v":2}]
["2021-01-03","client37","Produit04",48.84,5,{"$f":"ventes[[#This Row],[PRIX UNITAIRE (FCFA)]]*ventes[[#This Row],[QUANTITE]]","v":244.20000000000002},{"$f":"VLOOKUP(ventes[[#This Row],[CLIENTS]],localisations[],2,0)","v":"Inde"},{"$f":"VLOOKUP(ventes[[#This Row],[CLIENTS]],localisations[],3,0)","v":"Asie"},{"$f":"TEXT(ventes[[#This Row],[DATES]],\"mmm\")","v":"janv"},{"$f":"WEEKNUM(ventes[[#This Row],[DATES]])","v":2}]
["2021-01-04","client32","Produit29",53.11,1,{"$f":"ventes[[#This Row],[PRIX UNITAIRE (FCFA)]]*ventes[[#This Row],[QUANTITE]]","v":53.11},{"$f":"VLOOKUP(ventes[[#This Row],[CLIENTS]],localisations[],2,0)","v":"Indonésie"},{"$f":"VLOOKUP(ventes[[#This Row],[CLIENTS]],localisations[],3,0)","v":"Asie"},{"$f":"TEXT(ventes[[#This Row],[DATES]],\"mmm\")","v":"janv"},{"$f":"WEEKNUM(ventes[[#This Row],[DATES]])","v":2}]
["2021-01-04","client09","Produit12",94.17,8,{"$f":"ventes[[#This Row],[PRIX UNITAIRE (FCFA)]]*ventes[[#This Row],[QUANTITE]]","v":753.36},{"$f":"VLOOKUP(ventes[[#This Row],[CLIENTS]],localisations[],2,0)","v":"Égypte"},{"$f":"VLOOKUP(ventes[[#This Row],[CLIENTS]],localisations[],3,0)","v":"Afrique"},{"$f":"TEXT(ventes[[#This Row],[DATES]],\"mmm\")","v":"janv"},{"$f":"WEEKNUM(ventes[[#This Row],[DATES]])","v":2}]
["2021-01-04","client26","Produit35",6.7,12,{"$f":"ventes[[#This Row],[PRIX UNITAIRE (FCFA)]]*ventes[[#This Row],[QUANTITE]]","v":80.400000000000006},{"$f":"VLOOKUP(ventes[[#This Row],[CLIENTS]],localisations[],2,0)","v":"Pérou"},{"$f":"VLOOKUP(ventes[[#This Row],[CLIENTS]],localisations[],3,0)","v":"Amérique"},{"$f":"TEXT(ventes[[#This Row],[DATES]],\"mmm\")","v":"janv"},{"$f":"WEEKNUM(ventes[[#This Row],[DATES]])","v":2}]
["2021-01-06","client06","Produit32",117.48,9,{"$f":"ventes[[#This Row],[PRIX UNITAIRE (FCFA)]]*ventes[[#This Row],[QUANTITE]]","v":1057.32},{"$f":"VLOOKUP(ventes[[#This Row],[CLIENTS]],localisations[],2,0)","v":"Afrique du Sud"},{"$f":"VLOOKUP(ventes[[#This Row],[CLIENTS]],localisations[],3,0)","v":"Afrique"},{"$f":"TEXT(ventes[[#This Row],[DATES]],\"mmm\")","v":"janv"},{"$f":"WEEKNUM(ventes[[#This Row],[DATES]])","v":2}]
["2021-01-08","client09","Produit19",210,14,{"$f":"ventes[[#This Row],[PRIX UNITAIRE (FCFA)]]*ventes[[#This Row],[QUANTITE]]","v":2940},{"$f":"VLOOKUP(ventes[[#This Row],[CLIENTS]],localisations[],2,0)","v":"Égypte"},{"$f":"VLOOKUP(ventes[[#This Row],[CLIENTS]],localisations[],3,0)","v":"Afrique"},{"$f":"TEXT(ventes[[#This Row],[DATES]],\"mmm\")","v":"janv"},{"$f":"WEEKNUM(ventes[[#This Row],[DATES]])","v":2}]
["2021-01-09","client01","Produit07",47.730000000000004,26,{"$f":"ventes[[#This Row],[PRIX UNITAIRE (FCFA)]]*ventes[[#This Row],[QUANTITE]]","v":1240.98},{"$f":"VLOOKUP(ventes[[#This Row],[CLIENTS]],localisations[],2,0)","v":"Tunisie"},{"$f":"VLOOKUP(ventes[[#This Row],[CLIENTS]],localisations[],3,0)","v":"Afrique"},{"$f":"TEXT(ventes[[#This Row],[DATES]],\"mmm\")","v":"janv"},{"$f":"WEEKNUM(ventes[[#This Row],[DATES]])","v":2}]
["2021-01-09","client05","Produit31",104.16,1,{"$f":"ventes[[#This Row],[PRIX UNITAIRE (FCFA)]]*ventes[[#This Row],[QUANTITE]]","v":104.16},{"$f":"VLOOKUP(ventes[[#This Row],[CLIENTS]],localisations[],2,0)","v":"Algérie"},{"$f":"VLOOKUP(ventes[[#This Row],[CLIENTS]],localisations[],3,0)","v":"Afrique"},{"$f":"TEXT(ventes[[#This Row],[DATES]],\"mmm\")","v":"janv"},{"$f":"WEEKNUM(ventes[[#This Row],[DATES]])","v":2}]
["2021-01-09","client34","Produit25",8.33,4,{"$f":"ventes[[#This Row],[PRIX UNITAIRE (FCFA)]]*ventes[[#This Row],[QUANTITE]]","v":33.32},{"$f":"VLOOKUP(ventes[[#This Row],[CLIENTS]],localisations[],2,0)","v":"Japon"},{"$f":"VLOOKUP(ventes[[#This Row],[CLIENTS]],localisations[],3,0)","v":"Asie"},{"$f":"TEXT(ventes[[#This Row],[DATES]],\"mmm\")","v":"janv"},{"$f":"WEEKNUM(ventes[[#This Row],[DATES]])","v":2}]
["2021-01-09","client16","Produit31",104.16,29,{"$f":"ventes[[#This Row],[PRIX UNITAIRE (FCFA)]]*ventes[[#This Row],[QUANTITE]]","v":3020.64},{"$f":"VLOOKUP(ventes[[#This Row],[CLIENTS]],localisations[],2,0)","v":"Royaume-Uni"},{"$f":"VLOOKUP(ventes[[#This Row],[CLIENTS]],localisations[],3,0)","v":"Europe"},{"$f":"TEXT(ventes[[#This Row],[DATES]],\"mmm\")","v":"janv"},{"$f":"WEEKNUM(ventes[[#This Row],[DATES]])","v":2}]
["2021-01-09","client19","Produit40",115.2,28,{"$f":"ventes[[#This Row],[PRIX UNITAIRE (FCFA)]]*ventes[[#This Row],[QUANTITE]]","v":3225.6},{"$f":"VLOOKUP(ventes[[#This Row],[CLIENTS]],localisations[],2,0)","v":"Suisse"},{"$f":"VLOOKUP(ventes[[#This Row],[CLIENTS]],localisations[],3,0)","v":"Europe"},{"$f":"TEXT(ventes[[#This Row],[DATES]],\"mmm\")","v":"janv"},{"$f":"WEEKNUM(ventes[[#This Row],[DATES]])","v":2}]
["2021-01-09","client20","Produit03",80.94,8,{"$f":"ventes[[#This Row],[PRIX UNITAIRE (FCFA)]]*ventes[[#This Row],[QUANTITE]]","v":647.52},{"$f":"VLOOKUP(ventes[[#This Row],[CLIENTS]],localisations[],2,0)","v":"France"},{"$f":"VLOOKUP(ventes[[#This Row],[CLIENTS]],localisations[],3,0)","v":"Europe"},{"$f":"TEXT(ventes[[#This Row],[DATES]],\"mmm\")","v":"janv"},{"$f":"WEEKNUM(ventes[[#This Row],[DATES]])","v":2}]
["2021-01-09","client36","Produit32",117.48,12,{"$f":"ventes[[#This Row],[PRIX UNITAIRE (FCFA)]]*ventes[[#This Row],[QUANTITE]]","v":1409.76},{"$f":"VLOOKUP(ventes[[#This Row],[CLIENTS]],localisations[],2,0)","v":"Vietnam"},{"$f":"VLOOKUP(ventes[[#This Row],[CLIENTS]],localisations[],3,0)","v":"Asie"},{"$f":"TEXT(ventes[[#This Row],[DATES]],\"mmm\")","v":"janv"},{"$f":"WEEKNUM(ventes[[#This Row],[DATES]])","v":2}]
["2021-01-10","client03","Produit02",142.80000000000001,24,{"$f":"ventes[[#This Row],[PRIX UNITAIRE (FCFA)]]*ventes[[#This Row],[QUANTITE]]","v":3427.2000000000003},{"$f":"VLOOKUP(ventes[[#This Row],[CLIENTS]],localisations[],2,0)","v":"Côte d'Ivoire"},{"$f":"VLOOKUP(ventes[[#This Row],[CLIENTS]],localisations[],3,0)","v":"Afrique"},{"$f":"TEXT(ventes[[#This Row],[DATES]],\"mmm\")","v":"janv"},{"$f":"WEEKNUM(ventes[[#This Row],[DATES]])","v":3}]
["2021-01-10","client21","Produit34",58.3,14,{"$f":"ventes[[#This Row],[PRIX UNITAIRE (FCFA)]]*ventes[[#This Row],[QUANTITE]]","v":816.19999999999993},{"$f":"VLOOKUP(ventes[[#This Row],[CLIENTS]],localisations[],2,0)","v":"Venezuela"},{"$f":"VLOOKUP(ventes[[#This Row],[CLIENTS]],localisations[],3,0)","v":"Amérique"},{"$f":"TEXT(ventes[[#This Row],[DATES]],\"mmm\")","v":"janv"},{"$f":"WEEKNUM(ventes[[#This Row],[DATES]])","v":3}]
["2021-01-10","client36","Produit35",6.7,9,{"$f":"ventes[[#This Row],[PRIX UNITAIRE (FCFA)]]*ventes[[#This Row],[QUANTITE]]","v":60.300000000000004},{"$f":"VLOOKUP(ventes[[#This Row],[CLIENTS]],localisations[],2,0)","v":"Vietnam"},{"$f":"VLOOKUP(ventes[[#This Row],[CLIENTS]],localisations[],3,0)","v":"Asie"},{"$f":"TEXT(ventes[[#This Row],[DATES]],\"mmm\")","v":"janv"},{"$f":"WEEKNUM(ventes[[#This Row],[DATES]])","v":3}]
["2021-01-11","client03","Produit37",85.76,3,{"$f":"ventes[[#This Row],[PRIX UNITAIRE (FCFA)]]*ventes[[#This Row],[QUANTITE]]","v":257.28000000000003},{"$f":"VLOOKUP(ventes[[#This Row],[CLIENTS]],localisations[],2,0)","v":"Côte d'Ivoire"},{"$f":"VLOOKUP(ventes[[#This Row],[CLIENTS]],localisations[],3,0)","v":"Afrique"},{"$f":"TEXT(ventes[[#This Row],[DATES]],\"mmm\")","v":"janv"},{"$f":"WEEKNUM(ventes[[#This Row],[DATES]])","v":3}]
{"$rows_left_out":803}
{"sheet":"Localisations","index":1,"n_rows":41,"n_cols":3,"rows_kept":41,"cut":false,"hidden":false,"merged":[]}
["Clients","Pays","Région "]
["Client01","Tunisie","Afrique"]
["Client02","Ghana","Afrique"]
["Client03","Côte d'Ivoire","Afrique"]
["Client04","Sénégal","Afrique"]
["Client05","Algérie","Afrique"]
["Client06","Afrique du Sud","Afrique"]
["Client07","Éthiopie","Afrique"]
["Client08","Maroc","Afrique"]
["Client09","Égypte","Afrique"]
["Client10","Nigeria","Afrique"]
["Client11","Espagne","Europe"]
["Client12","Pologne","Europe"]
["Client13","Italie","Europe"]
["Client14","Pays-Bas","Europe"]
["Client15","Allemagne","Europe"]
["Client16","Royaume-Uni","Europe"]
["Client17","Suède","Europe"]
["Client18","Belgique","Europe"]
["Client19","Suisse","Europe"]
["Client20","France","Europe"]
["Client21","Venezuela","Amérique"]
["Client22","Canada","Amérique"]
["Client23","Argentine","Amérique"]
["Client24","Équateur","Amérique"]
["Client25","Brésil","Amérique"]
["Client26","Pérou","Amérique"]
["Client27","Mexique","Amérique"]
["Client28","États-Unis","Amérique"]
["Client29","Chili","Amérique"]
{"$rows_left_out":12}
{"sheet":"Objectifs","index":2,"n_rows":13,"n_cols":6,"rows_kept":13,"cut":false,"hidden":false,"merged":[]}
["numero_mois","Mois","Objectif financier","Chiffre d'Affaires"," En dessous","Au dessus"]
[1,"janv",90000,{"$f":"VLOOKUP(Tableau3[[#This Row],[Mois]],Analyses!C:D,2,0)","v":92118.789999999964},{"$f":"IF(Tableau3[[#This Row],[Chiffre d''Affaires]]<Tableau3[[#This Row],[Objectif financier]],Tableau3[[#This Row],[Chiffre d''Affaires]],\"#NA\")","v":"#NA"},{"$f":"IF(Tableau3[[#This Row],[Chiffre d''Affaires]]>=Tableau3[[#This Row],[Objectif financier]],Tableau3[[#This Row],[Chiffre d''Affaires]],\"#NA\")","v":92118.789999999964}]
[2,"févr",100000,{"$f":"VLOOKUP(Tableau3[[#This Row],[Mois]],Analyses!C:D,2,0)","v":91137.049999999988},{"$f":"IF(Tableau3[[#This Row],[Chiffre d''Affaires]]<Tableau3[[#This Row],[Objectif financier]],Tableau3[[#This Row],[Chiffre d''Affaires]],\"#NA\")","v":91137.049999999988},{"$f":"IF(Tableau3[[#This Row],[Chiffre d''Affaires]]>=Tableau3[[#This Row],[Objectif financier]],Tableau3[[#This Row],[Chiffre d''Affaires]],\"#NA\")","v":"#NA"}]
[3,"mars",100000,{"$f":"VLOOKUP(Tableau3[[#This Row],[Mois]],Analyses!C:D,2,0)","v":97920.72},{"$f":"IF(Tableau3[[#This Row],[Chiffre d''Affaires]]<Tableau3[[#This Row],[Objectif financier]],Tableau3[[#This Row],[Chiffre d''Affaires]],\"#NA\")","v":97920.72},{"$f":"IF(Tableau3[[#This Row],[Chiffre d''Affaires]]>=Tableau3[[#This Row],[Objectif financier]],Tableau3[[#This Row],[Chiffre d''Affaires]],\"#NA\")","v":"#NA"}]
[4,"avr",100000,{"$f":"VLOOKUP(Tableau3[[#This Row],[Mois]],Analyses!C:D,2,0)","v":72320.89},{"$f":"IF(Tableau3[[#This Row],[Chiffre d''Affaires]]<Tableau3[[#This Row],[Objectif financier]],Tableau3[[#This Row],[Chiffre d''Affaires]],\"#NA\")","v":72320.89},{"$f":"IF(Tableau3[[#This Row],[Chiffre d''Affaires]]>=Tableau3[[#This Row],[Objectif financier]],Tableau3[[#This Row],[Chiffre d''Affaires]],\"#NA\")","v":"#NA"}]
[5,"mai",90000,{"$f":"VLOOKUP(Tableau3[[#This Row],[Mois]],Analyses!C:D,2,0)","v":70511.75999999998},{"$f":"IF(Tableau3[[#This Row],[Chiffre d''Affaires]]<Tableau3[[#This Row],[Objectif financier]],Tableau3[[#This Row],[Chiffre d''Affaires]],\"#NA\")","v":70511.75999999998},{"$f":"IF(Tableau3[[#This Row],[Chiffre d''Affaires]]>=Tableau3[[#This Row],[Objectif financier]],Tableau3[[#This Row],[Chiffre d''Affaires]],\"#NA\")","v":"#NA"}]
[6,"juin",80000,{"$f":"VLOOKUP(Tableau3[[#This Row],[Mois]],Analyses!C:D,2,0)","v":66727.399999999994},{"$f":"IF(Tableau3[[#This Row],[Chiffre d''Affaires]]<Tableau3[[#This Row],[Objectif financier]],Tableau3[[#This Row],[Chiffre d''Affaires]],\"#NA\")","v":66727.399999999994},{"$f":"IF(Tableau3[[#This Row],[Chiffre d''Affaires]]>=Tableau3[[#This Row],[Objectif financier]],Tableau3[[#This Row],[Chiffre d''Affaires]],\"#NA\")","v":"#NA"}]
[7,"juil",95000,{"$f":"VLOOKUP(Tableau3[[#This Row],[Mois]],Analyses!C:D,2,0)","v":92661.550000000017},{"$f":"IF(Tableau3[[#This Row],[Chiffre d''Affaires]]<Tableau3[[#This Row],[Objectif financier]],Tableau3[[#This Row],[Chiffre d''Affaires]],\"#NA\")","v":92661.550000000017},{"$f":"IF(Tableau3[[#This Row],[Chiffre d''Affaires]]>=Tableau3[[#This Row],[Objectif financier]],Tableau3[[#This Row],[Chiffre d''Affaires]],\"#NA\")","v":"#NA"}]
[8,"août",90000,{"$f":"VLOOKUP(Tableau3[[#This Row],[Mois]],Analyses!C:D,2,0)","v":69125.749999999985},{"$f":"IF(Tableau3[[#This Row],[Chiffre d''Affaires]]<Tableau3[[#This Row],[Objectif financier]],Tableau3[[#This Row],[Chiffre d''Affaires]],\"#NA\")","v":69125.749999999985},{"$f":"IF(Tableau3[[#This Row],[Chiffre d''Affaires]]>=Tableau3[[#This Row],[Objectif financier]],Tableau3[[#This Row],[Chiffre d''Affaires]],\"#NA\")","v":"#NA"}]
[9,"sept",90000,{"$f":"VLOOKUP(Tableau3[[#This Row],[Mois]],Analyses!C:D,2,0)","v":78253.529999999984},{"$f":"IF(Tableau3[[#This Row],[Chiffre d''Affaires]]<Tableau3[[#This Row],[Objectif financier]],Tableau3[[#This Row],[Chiffre d''Affaires]],\"#NA\")","v":78253.529999999984},{"$f":"IF(Tableau3[[#This Row],[Chiffre d''Affaires]]>=Tableau3[[#This Row],[Objectif financier]],Tableau3[[#This Row],[Chiffre d''Affaires]],\"#NA\")","v":"#NA"}]
[10,"oct",80000,{"$f":"VLOOKUP(Tableau3[[#This Row],[Mois]],Analyses!C:D,2,0)","v":87136.37},{"$f":"IF(Tableau3[[#This Row],[Chiffre d''Affaires]]<Tableau3[[#This Row],[Objectif financier]],Tableau3[[#This Row],[Chiffre d''Affaires]],\"#NA\")","v":"#NA"},{"$f":"IF(Tableau3[[#This Row],[Chiffre d''Affaires]]>=Tableau3[[#This Row],[Objectif financier]],Tableau3[[#This Row],[Chiffre d''Affaires]],\"#NA\")","v":87136.37}]
[11,"nov",80000,{"$f":"VLOOKUP(Tableau3[[#This Row],[Mois]],Analyses!C:D,2,0)","v":75659.86},{"$f":"IF(Tableau3[[#This Row],[Chiffre d''Affaires]]<Tableau3[[#This Row],[Objectif financier]],Tableau3[[#This Row],[Chiffre d''Affaires]],\"#NA\")","v":75659.86},{"$f":"IF(Tableau3[[#This Row],[Chiffre d''Affaires]]>=Tableau3[[#This Row],[Objectif financier]],Tableau3[[#This Row],[Chiffre d''Affaires]],\"#NA\")","v":"#NA"}]
[12,"déc",110000,{"$f":"VLOOKUP(Tableau3[[#This Row],[Mois]],Analyses!C:D,2,0)","v":89270.59},{"$f":"IF(Tableau3[[#This Row],[Chiffre d''Affaires]]<Tableau3[[#This Row],[Objectif financier]],Tableau3[[#This Row],[Chiffre d''Affaires]],\"#NA\")","v":89270.59},{"$f":"IF(Tableau3[[#This Row],[Chiffre d''Affaires]]>=Tableau3[[#This Row],[Objectif financier]],Tableau3[[#This Row],[Chiffre d''Affaires]],\"#NA\")","v":"#NA"}]

{"sheet":"Analyses","index":3,"n_rows":55,"n_cols":22,"rows_kept":55,"cut":false,"hidden":false,"merged":[]}
[]
["Chiffre d'Affaires Global",null,"Mois","Chiffre d'Affaires",null,"Sémaine de l'année","Chiffre d'Affaires",null,"Clients","Chiffre d'Affaires",null,"Produits","Chiffre d'Affaires",null,"Région","Chiffre d'Affaires",null,"Pays","Chiffre d'Affaires"]
[982844.25999999919,null,"janv",92118.789999999964,null,1,5179.59,null,"client33",60929.149999999994,null,"Produit10",34991.64,null,"Afrique",228837.42000000013,null,"Afrique du Sud",33252.920000000006]
[null,null,"févr",91137.049999999988,null,2,21116.729999999996,null,"client22",45112.94999999999,null,"Produit42",38232,null,"Amérique",294506.85000000009,null,"Algérie",23913.72,null,{"$f":"OFFSET(R2,1,0,COUNTA(R3:R42),2)","v":"Afrique du Sud"},33252.920000000006]
[null,null,"mars",97920.72,null,3,14261.190000000004,null,"client23",43062.83,null,"Produit05",38591.280000000006,null,"Asie",187387.62,null,"Allemagne",33187.040000000008,null,"Algérie",23913.72]
[{"$f":"OFFSET(A2,1,0,1,1)","v":982844.25999999919},null,"avr",72320.89,null,4,11433.2,null,null,null,null,"Produit21",39659.759999999995,null,"Europe",272112.37000000011,null,"Argentine",43062.83,null,"Allemagne",33187.040000000008]
[null,null,"mai",70511.75999999998,null,5,33727.55000000001,null,null,null,null,"Produit32",40883.039999999994,null,null,null,null,"Belgique",16353.01,null,"Argentine",43062.83]
[null,null,"juin",66727.399999999994,null,6,34794.820000000007,null,{"$f":"I3","v":"client33"},{"$f":"J3","v":60929.149999999994},null,"Produit22",41055.299999999996,null,null,null,null,"Brésil",39653.929999999993,null,"Belgique",16353.01]
[null,null,"juil",92661.550000000017,null,7,32107.100000000006,null,{"$f":"I4","v":"client22"},{"$f":"J4","v":45112.94999999999},null,"Produit19",41580,null,null,null,null,"Canada",45112.94999999999,null,"Brésil",39653.929999999993]
[null,null,"août",69125.749999999985,null,8,11777.67,null,"client23",43062.83,null,"Produit24",49599.360000000008,null,null,null,null,"Chili",24862.519999999997,null,"Canada",45112.94999999999]
[null,null,"sept",78253.529999999984,null,9,17571.589999999997,null,null,null,null,"Produit41",57554.28,null,null,null,null,"Colombie",35431.860000000008,null,"Chili",24862.519999999997]
[null,null,"oct",87136.37,null,10,17413.299999999996,null,null,null,null,"Produit30",57968.639999999992,null,null,null,null,"Corée du Sud",17704.34,null,"Colombie",35431.860000000008]
[null,null,"nov",75659.86,null,11,18811.389999999996,null,null,null,null,null,null,null,null,null,null,"Côte d'Ivoire",7541.72,null,"Corée du Sud",17704.34]
[null,null,"déc",89270.59,null,12,29446.460000000003,null,null,null,null,null,null,null,null,null,null,"Égypte",24159.03,null,"Côte d'Ivoire",7541.72]
[null,null,null,null,null,13,22723.600000000002,null,null,null,null,{"$f":"L3","v":"Produit10"},34991.64,null,null,null,null,"Équateur",13549.7,null,"Égypte",24159.03]
[null,null,null,null,null,14,13729.810000000001,null,null,null,null,"Produit42",38232,null,null,null,null,"Espagne",30344.9,null,"Équateur",13549.7]
[null,null,null,null,null,15,27820.09,null,null,null,null,"Produit05",38591.280000000006,null,null,null,null,"États-Unis",14337.400000000003,null,"Espagne",30344.9]
[null,null,null,null,null,16,9407.51,null,null,null,null,"Produit21",39659.759999999995,null,null,null,null,"Éthiopie",8394.32,null,"États-Unis",14337.400000000003]
[null,null,null,null,null,17,22127.300000000003,null,null,null,null,"Produit32",40883.039999999994,null,null,null,null,"France",26437.860000000004,null,"Éthiopie",8394.32]
[null,null,null,null,null,18,11809.4,null,null,null,null,"Produit22",41055.299999999996,null,null,null,null,"Ghana",31336.229999999992,null,"France",26437.860000000004]
[null,null,null,null,null,19,12750.539999999997,null,null,null,null,"Produit19",41580,null,null,null,null,"Inde",5519.83,null,"Ghana",31336.229999999992]
[null,null,null,null,null,20,19691.759999999998,null,null,null,null,"Produit24",49599.360000000008,null,null,null,null,"Indonésie",15829.48,null,"Inde",5519.83]
[null,null,null,null,null,21,19171.71,null,null,null,null,"Produit41",57554.28,null,null,null,null,"Italie",6251.4,null,"Indonésie",15829.48]
[null,null,null,null,null,22,11617.86,null,null,null,null,"Produit30",57968.639999999992,null,null,null,null,"Japon",10923.66,null,"Italie",6251.4]
[null,null,null,null,null,23,17000.620000000003,null,null,null,null,null,null,null,null,null,null,"Malaisie",13827.74,null,"Japon",10923.66]
[null,null,null,null,null,24,15273.349999999999,null,null,null,null,null,null,null,null,null,null,"Maroc",24311.18,null,"Malaisie",13827.74]
[null,null,null,null,null,25,23043.470000000005,null,null,null,null,null,null,null,null,null,null,"Mexique",14192.22,null,"Maroc",24311.18]
[null,null,null,null,null,26,13593.79,null,null,null,null,null,null,null,null,null,null,"Nigeria",14222.83,null,"Mexique",14192.22]
[null,null,null,null,null,27,13197.89,null,null,null,null,null,null,null,null,null,null,"Pakistan",34502.94,null,"Nigeria",14222.83]
[null,null,null,null,null,28,13311.339999999998,null,null,null,null,null,null,null,null,null,null,"Pays-Bas",30826.78,null,"Pakistan",34502.94]
{"$rows_left_out":26}
{"sheet":"Tableau de Bord","index":4,"n_rows":0,"n_cols":0,"rows_kept":0,"cut":false,"hidden":false,"merged":[]}